BDBM50199599 7-(3-(4-fluoropiperidin-1-yl)propoxy)-2-methyl-4-(3-(trifluoromethyl)phenyl)-1,2,3,4-tetrahydroisoquinoline::CHEMBL246747
SMILES CN1CC(c2cccc(c2)C(F)(F)F)c2ccc(OCCCN3CCC(F)CC3)cc2C1
InChI Key InChIKey=NZPOPKFDIKJIRC-UHFFFAOYSA-N
Data  3 KI
  Tab Delimited (TSV)   2D SDfile   Computed 3D by Vconf -m prep SDfile
Find this compound or compounds like it in BindingDB:
Activity Spreadsheet -- Enzyme Inhibition Constant Data from BindingDB
Found 2 hits for monomerid = 50199599
TargetSodium-dependent serotonin transporter(Homo sapiens (Human))
Johnson & Johnson Pharmaceutical Research And Development
Curated by ChEMBL
LigandPNGBDBM50199599(7-(3-(4-fluoropiperidin-1-yl)propoxy)-2-methyl-4-(...)
Affinity DataKi:  15nM. Assay description: Binding affinity at human SERT
In DepthDetails ArticlePubMed
TargetSodium-dependent serotonin transporter(Rattus norvegicus (rat))
Johnson & Johnson Pharmaceutical Research And Development
Curated by ChEMBL
LigandPNGBDBM50199599(7-(3-(4-fluoropiperidin-1-yl)propoxy)-2-methyl-4-(...)
Affinity DataKi:  30nM. Assay description: Binding affinity at rat SERT
In DepthDetails ArticlePubMed